{"text_format":"1","workbook":"xlsx","n_sheets":8,"sheets":["Notes","Planets - Planètes","Terraformation","Difficulties - Difficultés","Language","MAP","Sources","Infos diverses & Notes"],"not_rendered":{"charts":0,"images":12,"macros":1,"external_links":0,"defined_names":46,"comments":0,"pivot_tables":0},"unopened":[],"bounds":{"document_bytes":16777216,"sheet_cells":100000,"rows_first":2000,"rows_last":500,"rows_between":2000,"halvings":0,"cell_chars":16384,"cell_head_chars":4096},"cells_cut":0,"cells_raw":0,"read":"whole","date_system":"1900"}

{"sheet":"Notes","index":0,"n_rows":39,"n_cols":3,"rows_kept":39,"cut":false,"hidden":false,"merged":[]}
["Endless Space 2",{"$f":"Language!A2","v":"Planets and Terraforming"}]
["V1.4.9 S5","V2.4","←Choose language"]
[null,null,"↖ Choisir la langue"]
[]
[]
["Français",null,"English"]
["Macros :\nElles ne sont pas obligatoires mais elles permettent de changer correctement de langue, de vérifier les cohérences entre les choix sur la page 'Terraformation' (par exemple: empêche de selectionner plus d'une spécialisation de planète).\n\nVous pouvez vérifier les macros avant de les activer avec Alt+F11.\nIl n'y a aucun mot de passe.",null,"Macros:\nThey are not mandatory but they allow to change correctly language, check the coherences between the choices on the page 'Terraforming' (for example: prevents selection of more than one planet specialization).\n\nYou can check the macros before activating them with Alt + F11.\nThere is no password."]
["\n\n\n"]
["Note",null,"Note"]
["Lors d'un jeu, je me suis demandé si je pouvez améliorer mon super système industriel composé de planètes de type chaude (laves et déserts) en le terraformant.\nJ'ai donc sortie ma feuille de papier et commencé à compter les points. Finalement tout ça s'est retrouvé sur une feuille Excel.",null,"During a game, I wondered if I can improve my super industrial system composed of hot-type planets (lavas and deserts) by terraforming it.\nSo I took out my sheet of paper and started counting the points. Finally all this ended up on an Excel sheet."]
{"$rows_left_out":30}
{"sheet":"Planets - Planètes","index":1,"n_rows":43,"n_cols":42,"rows_kept":43,"cut":false,"hidden":false,"merged":[[0,30,0,33],[0,20,0,24],[0,34,0,36],[0,1,0,5],[0,9,0,13],[0,15,0,18],[37,39,38,39],[37,38,38,38],[2,40,3,40],[2,38,3,38],[2,39,3,39],[10,40,11,40],[19,40,20,40],[23,38,24,38],[23,39,24,39],[23,40,24,40]]}
[{"$f":"Language!A45","v":"Endless Space 2 - Planets"},{"$f":"Language!A46","v":"FIDSI"},null,null,null,null,null,null,null,{"$f":"Language!A47","v":"Population by size"},null,null,null,null,"Bonus",{"$f":"Language!A48","v":"Various informations"},null,null,null,"Tier",{"$f":"Language!A49","v":"Planet size probability"},null,null,null,null,null,null,null,null,null,{"$f":"Language!A50","v":"Terraforming"},null,null,null,{"$f":"Language!A51","v":"Riftborn terraforming"}]
[{"$f":"Language!A53","v":"Planet type"},{"$f":"Language!A54","v":"Food"},{"$f":"Language!A55","v":"Industry"},{"$f":"Language!A56","v":"Dust"},{"$f":"Language!A57","v":"Science"},{"$f":"Language!A58","v":"Influence"},{"$f":"Language!A59","v":"Approuval"},{"$f":"Language!A61","v":"Total FIDSI"},{"$f":"Language!A61 & CHAR(10) & CHAR(13) & \" - \" & Language!A59","v":"Total FIDSI\n\r - Approuval"},{"$f":"Language!A63","v":"Tiny"},{"$f":"Language!A64","v":"Small"},{"$f":"Language!A65","v":"Medium"},{"$f":"Language!A66","v":"Large"},{"$f":"Language!A67","v":"Huge"},{"$f":"Language!A68&INDEX($AM$5:$AM$9,A38)","v":"Total X Population on Medium"},{"$f":"Language!A69","v":"Planet class"},{"$f":"Language!A71","v":"Temperature"},{"$f":"Language!A72","v":"Land"},{"$f":"Language!A73","v":"Tree (Guardians)"},{"$f":"Language!A74","v":"Tier"},{"$f":"Language!A75","v":"% tiny"},{"$f":"Language!A76","v":"% small"},{"$f":"Language!A77","v":"% medium"},{"$f":"Language!A78","v":"% large"},{"$f":"Language!A79","v":"% huge"},"Tiny","Small","Normal","Large","Huge",null,{"$f":"Language!A85","v":"Terraforming to"},null,"  ","  ",{"$f":"Language!A85","v":"Terraforming to"},{"$f":"Language!A86","v":"Cost = 2000"}]
[{"$f":"Language!$A5","v":"Terran"},8,3,4,4,null,null,{"$f":"SUM(B3:F3)","v":19},{"$f":"SUM(B3:G3)","v":19},{"$f":"AN$9+AO$13","v":6},{"$f":"AN$8+AO$13","v":7},{"$f":"AN$7+AO$13","v":8},{"$f":"AN$6+AO$13","v":9},{"$f":"AN$5+AO$13","v":10},{"$f":"I3*INDEX($J$3:$N$28,CELL(\"ligne\",O3)-2,6-$A$38)","v":152},"P1",{"$f":"Language!A$41","v":"Temperate"},{"$f":"Language!A$38","v":"Fertile"},"ü","T1",{"$f":"Z3/SUM($Z3:$AD3)","v":0.35714285714285715},{"$f":"AA3/SUM($Z3:$AD3)","v":0.21428571428571427},0.21428571428571427,0.14285714285714285,7.1428571428571425E-2,5,3,3,2,1,null,null,null,null,{"$f":"Language!A36","v":"Mediterran."},{"$f":"A13","v":"Monsoon"},{"$f":"A8","v":"Jungle"},null,{"$f":"Language!A112","v":"Non-Gas planet size"},{"$f":"Language!A114","v":"Default population"},{"$f":"Language!A121","v":"Depletion points"}]
[{"$f":"Language!$A6","v":"Forest"},8,4,4,3,null,null,{"$f":"SUM(B4:F4)","v":19},19,{"$f":"AN$9+AO$13","v":6},{"$f":"AN$8+AO$13","v":7},{"$f":"AN$7+AO$13","v":8},{"$f":"AN$6+AO$13","v":9},{"$f":"AN$5+AO$13","v":10},152,"P1",{"$f":"Language!A$41","v":"Temperate"},{"$f":"Language!A$38","v":"Fertile"},"ü","T1",{"$f":"Z4/SUM($Z4:$AD4)","v":0.35714285714285715},{"$f":"AA4/SUM($Z4:$AD4)","v":0.21428571428571427},{"$f":"AB4/SUM($Z4:$AD4)","v":0.21428571428571427},{"$f":"AC4/SUM($Z4:$AD4)","v":0.14285714285714285},{"$f":"AD4/SUM($Z4:$AD4)","v":7.1428571428571425E-2},5,3,3,2,1,null,null,null,null,{"$f":"A9","v":"Tundra"},{"$f":"A13","v":"Monsoon"},{"$f":"A7","v":"Boreal"}]
[{"$f":"Language!$A7","v":"Ocean"},8,2,4,6,null,null,20,20,{"$f":"AN$9+AO$13","v":6},{"$f":"AN$8+AO$13","v":7},{"$f":"AN$7+AO$13","v":8},{"$f":"AN$6+AO$13","v":9},{"$f":"AN$5+AO$13","v":10},160,"P1",{"$f":"Language!A$41","v":"Temperate"},{"$f":"Language!A$38","v":"Fertile"},null,"T1",0.35714285714285715,0.21428571428571427,0.21428571428571427,0.14285714285714285,7.1428571428571425E-2,5,3,3,2,1,null,null,null,null,{"$f":"A7","v":"Boreal"},null,null,null,{"$f":"Language!A$67","v":"Huge"},5,200]
[{"$f":"Language!$A8","v":"Atoll"},8,6,4,2,null,null,20,20,{"$f":"AN$9+AO$13","v":6},{"$f":"AN$8+AO$13","v":7},{"$f":"AN$7+AO$13","v":8},{"$f":"AN$6+AO$13","v":9},{"$f":"AN$5+AO$13","v":10},160,"P1",{"$f":"Language!A$41","v":"Temperate"},{"$f":"Language!A$38","v":"Fertile"},null,"T1",0.35714285714285715,0.21428571428571427,0.21428571428571427,0.14285714285714285,7.1428571428571425E-2,5,3,3,2,1,null,null,null,null,{"$f":"A8","v":"Jungle"},null,null,null,{"$f":"Language!A$66","v":"Large"},4,180]
[{"$f":"Language!$A9","v":"Boreal"},6,null,3,5,null,null,14,14,{"$f":"AN$9+AO$14","v":5},{"$f":"AN$8+AO$14","v":6},{"$f":"AN$7+AO$14","v":7},{"$f":"AN$6+AO$14","v":8},{"$f":"AN$5+AO$14","v":9},98,"P2",{"$f":"Language!A$42","v":"Cold"},{"$f":"Language!A$38","v":"Fertile"},"ü","T1",0.35714285714285715,0.21428571428571427,0.21428571428571427,0.14285714285714285,7.1428571428571425E-2,5,3,3,2,1,{"$f":"A5","v":"Ocean"},"- 2000",{"$f":"A4","v":"Forest"},"- 2000",{"$f":"A14","v":"Snow"},{"$f":"A9","v":"Tundra"},null,null,{"$f":"Language!A$65","v":"Medium"},3,150]
[{"$f":"Language!$A10","v":"Jungle"},6,5,3,null,null,null,14,14,5,6,7,8,9,98,"P2",{"$f":"Language!A$43","v":"Hot"},{"$f":"Language!A$38","v":"Fertile"},"ü","T1",0.35714285714285715,0.21428571428571427,0.21428571428571427,0.14285714285714285,7.1428571428571425E-2,5,3,3,2,1,{"$f":"A3","v":"Terran"},"- 2000",{"$f":"A6","v":"Atoll"},"- 2000",{"$f":"A15","v":"Arid"},{"$f":"Language!A36","v":"Mediterran."},null,null,{"$f":"Language!A$64","v":"Small"},2,120]
[{"$f":"Language!$A11","v":"Tundra"},6,null,3,6,null,-1,15,14,5,6,7,8,9,98,"P2",{"$f":"Language!A$42","v":"Cold"},null,null,"T1",0.21428571428571427,0.35714285714285715,0.21428571428571427,0.14285714285714285,7.1428571428571425E-2,3,5,3,2,1,{"$f":"A7","v":"Boreal"},"- 2000",{"$f":"A4","v":"Forest"},"- 2000",{"$f":"A11","v":"Steppes"},{"$f":"A14","v":"Snow"},null,null,{"$f":"Language!A$63","v":"Tiny"},1,100]
[{"$f":"Language!$A12","v":"Mediterranean"},6,6,3,null,null,-1,15,14,5,6,7,8,9,98,"P2",{"$f":"Language!A$43","v":"Hot"},null,null,"T1",0.21428571428571427,0.35714285714285715,0.21428571428571427,0.14285714285714285,7.1428571428571425E-2,3,5,3,2,1,{"$f":"A3","v":"Terran"},"- 2000",{"$f":"A8","v":"Jungle"},"- 2000",{"$f":"A12","v":"Savannah"},{"$f":"A15","v":"Arid"}]
{"$rows_left_out":34}
{"sheet":"Terraformation","index":2,"n_rows":378,"n_cols":45,"rows_kept":378,"cut":false,"hidden":false,"merged":[[0,3,0,7],[15,3,15,8],[15,11,15,16],[14,3,14,8],[14,11,14,16]]}
[null,null,null,{"$f":"Language!A124","v":"Σ = FIDSI"}]
[null,null,{"$f":"Language!A156","v":"Terraformation\n\nPlanet: from → to"},{"$f":"Language!A54","v":"Food"},{"$f":"Language!A55","v":"Industry"},{"$f":"Language!A56","v":"Dust"},{"$f":"Language!A57","v":"Science"},{"$f":"Language!A58","v":"Influence"},{"$f":"Language!A59","v":"Approuval"},{"$f":"Language!A60","v":"Population"},{"$f":"Language!A$43","v":"Hot"},{"$f":"Language!A$42","v":"Cold"},{"$f":"Language!A$41","v":"Temperate"},{"$f":"Language!A$38","v":"Fertile"},{"$f":"Language!A$39","v":"Sterile"},{"$f":"Language!A$70","v":"Class"},null,null,null,null,null,null,{"$f":"Language!A185","v":"Links"},null,null,{"$f":"Language!A187","v":"Details\ncalculation"},{"$f":"Language!$A54","v":"Food"},{"$f":"Language!$A55","v":"Industry"},{"$f":"Language!$A56","v":"Dust"},{"$f":"Language!$A57","v":"Science"},{"$f":"Language!$A58","v":"Influence"},{"$f":"Language!$A59","v":"Approuval"},{"$f":"Language!$A60","v":"Population"},null,{"$f":"Language!$A54","v":"Food"},{"$f":"Language!$A55","v":"Industry"},{"$f":"Language!$A56","v":"Dust"},{"$f":"Language!$A57","v":"Science"},{"$f":"Language!$A58","v":"Influence"},{"$f":"Language!$A59","v":"Approuval"},{"$f":"Language!$A60","v":"Population"}]
[null,null,null,{"$f":"IF(AND(NOT(PopUmbral),$P$3=Language!$A$101),'Planets - Planètes'!B29,INDEX('Planets - Planètes'!B$3:B$32,'Planets - Planètes'!$A$36,1))","v":8},{"$f":"IF(AND(NOT(PopUmbral),$P$3=Language!$A$101),'Planets - Planètes'!C29,INDEX('Planets - Planètes'!C$3:C$32,'Planets - Planètes'!$A$36,1))","v":3},{"$f":"IF(AND(NOT(PopUmbral),$P$3=Language!$A$101),'Planets - Planètes'!D29,INDEX('Planets - Planètes'!D$3:D$32,'Planets - Planètes'!$A$36,1))","v":4},{"$f":"IF(AND(NOT(PopUmbral),$P$3=Language!$A$101),'Planets - Planètes'!E29,INDEX('Planets - Planètes'!E$3:E$32,'Planets - Planètes'!$A$36,1))","v":4},{"$f":"IF(AND(NOT(PopUmbral),$P$3=Language!$A$101),'Planets - Planètes'!F29,INDEX('Planets - Planètes'!F$3:F$32,'Planets - Planètes'!$A$36,1))","v":0},{"$f":"INDEX('Planets - Planètes'!G$3:G$32,'Planets - Planètes'!$A$36,1)","v":0},{"$f":"INDEX('Planets - Planètes'!$J$3:$N$32,'Planets - Planètes'!$A$36,6-'Planets - Planètes'!$A$38)","v":8},{"$f":"IF(INDEX('Planets - Planètes'!Q$3:Q$32,'Planets - Planètes'!$A$36,1)=Language!A43,1,0)","v":0},{"$f":"IF(INDEX('Planets - Planètes'!Q$3:Q$32,'Planets - Planètes'!$A$36,1)=Language!A42,1,0)","v":0},{"$f":"IF(INDEX('Planets - Planètes'!Q$3:Q$32,'Planets - Planètes'!$A$36,1)=Language!A41,1,0)","v":1},{"$f":"IF(INDEX('Planets - Planètes'!R$3:R$32,'Planets - Planètes'!$A$36,1)=Language!A$38,1,0)","v":1},{"$f":"IF(INDEX('Planets - Planètes'!R$3:R$32,'Planets - Planètes'!$A$36,1)=Language!A$39,1,0)","v":0},{"$f":"INDEX('Planets - Planètes'!P$3:P$32,'Planets - Planètes'!$A$36,1)","v":"P1"},null,null,null,null,null,null,null,null,"A","Base NIBSI + A + P",{"$f":"D$3","v":8},{"$f":"E$3","v":3},4,4,0,0,8,null,{"$f":"D$4","v":8},{"$f":"E$4","v":3},4,4,0,0,8,null,"A","Production de base NIBSI + Approbation sur planète par population  + Population max.","Raw FIDSI production + Approval on planet per population + Maximum Population "]
[false,null,null,{"$f":"IF(AND(NOT(PopUmbral),$P$4=Language!$A$101),'Planets - Planètes'!B29,INDEX('Planets - Planètes'!B$3:B$32,'Planets - Planètes'!$A$37,1))","v":8},{"$f":"IF(AND(NOT(PopUmbral),$P$4=Language!$A$101),'Planets - Planètes'!C29,INDEX('Planets - Planètes'!C$3:C$32,'Planets - Planètes'!$A$37,1))","v":3},{"$f":"IF(AND(NOT(PopUmbral),$P$4=Language!$A$101),'Planets - Planètes'!D29,INDEX('Planets - Planètes'!D$3:D$32,'Planets - Planètes'!$A$37,1))","v":4},{"$f":"IF(AND(NOT(PopUmbral),$P$4=Language!$A$101),'Planets - Planètes'!E29,INDEX('Planets - Planètes'!E$3:E$32,'Planets - Planètes'!$A$37,1))","v":4},{"$f":"IF(AND(NOT(PopUmbral),$P$4=Language!$A$101),'Planets - Planètes'!F29,INDEX('Planets - Planètes'!F$3:F$32,'Planets - Planètes'!$A$37,1))","v":0},{"$f":"INDEX('Planets - Planètes'!G$3:G$32,'Planets - Planètes'!$A$37,1)","v":0},{"$f":"INDEX('Planets - Planètes'!$J$3:$N$32,'Planets - Planètes'!$A$37,6-'Planets - Planètes'!$A$38)","v":8},{"$f":"IF(INDEX('Planets - Planètes'!Q$3:Q$32,'Planets - Planètes'!$A$37,1)=Language!A43,1,0)","v":0},{"$f":"IF(INDEX('Planets - Planètes'!Q$3:Q$32,'Planets - Planètes'!$A$37,1)=Language!A42,1,0)","v":0},{"$f":"IF(INDEX('Planets - Planètes'!Q$3:Q$32,'Planets - Planètes'!$A$37,1)=Language!A41,1,0)","v":1},{"$f":"IF(INDEX('Planets - Planètes'!R$3:R$32,'Planets - Planètes'!$A$37,1)=Language!A$38,1,0)","v":1},{"$f":"IF(INDEX('Planets - Planètes'!R$3:R$32,'Planets - Planètes'!$A$37,1)=Language!A$39,1,0)","v":0},{"$f":"INDEX('Planets - Planètes'!P$3:P$32,'Planets - Planètes'!$A$37,1)","v":"P1"},null,null,null,{"$f":"IF(A4,1,0)","v":0},{"$f":"Language!A178","v":"Explored moon(s)"},null,null,null,"B","Bonus améliorations",{"$f":"SUMIF($Z$19:$Z$286,\"=DUO\",D$19:D$286)+SUMIF($Z$19:$Z$286,\"=\",D$19:D$286)","v":0},0,0,0,0,0,{"$f":"SUM(J$19:J$286)","v":0},null,{"$f":"SUMIF($Z$19:$Z$286,\"=DUO\",L$19:L$286)+SUMIF($Z$19:$Z$286,\"=\",L$19:L$286)","v":0},0,0,0,0,0,{"$f":"SUM(R$19:R$286)","v":0},null,"B","Total des bonus des améliorations systèmes hors bonus Autotochnes par population","Total des bonus des améliorations systèmes hors bonus Autotochnes par population"]
[false,null,null,null,null,null,null,null,null,null,null,"Strat.","Luxe","Ano.","Red.","Escl.","OverPop","Neg.",null,{"$f":"IF(A5,1,0)","v":0},{"$f":"Language!A179","v":"Republic (laws bonus)"},null,null,null,"C","Somme A+B",{"$f":"AA3+AA4","v":8},{"$f":"AB3+AB4","v":3},4,4,0,0,{"$f":"SUM(AG3:AG4)","v":8},null,{"$f":"AI3+AI4","v":8},{"$f":"AJ3+AJ4","v":3},{"$f":"AK3+AK4","v":4},{"$f":"AL3+AL4","v":4},{"$f":"AM3+AM4","v":0},{"$f":"AN3+AN4","v":0},{"$f":"SUM(AO3:AO4)","v":8},null,"C","Somme = A+B                                         Production par population     (= L.9)","Sum = A+B                                                 Production per population     (= L.9)"]
[false,null,"Population",{"$f":"IF('Planets - Planètes'!$A$36<>'Planets - Planètes'!$A$37,'Planets - Planètes'!B35,\"Total des améliorations par population\")","v":"Total des améliorations par population"},null,null,null,null,null,null,null,{"$f":"SUM($B$135:$B$140)","v":0},{"$f":"SUM($B$142:$B$165)","v":0},{"$f":"SUM($B$176:$B$248)","v":0},{"$f":"SUMIF($K$179:$K$200,\"=\"&TRUE(),$B$179:$B$200)","v":0},{"$f":"IF($K$291,IF(AND($A$291>0,SUM($A$292:$A$336)>0),2,1),1)","v":1},{"$f":"J15>J16","v":false},{"$f":"SUMIF($K$190:$K$200,\"=\"&FALSE(),$B$190:$B$200)","v":0},null,{"$f":"IF(A6,1,0)","v":0},{"$f":"Language!A180","v":"Happy    / Loyal"},null,null,null,"D","Produit  C x <Pop>",{"$f":"AA5*$AG$6+$A$326*AA5","v":0},{"$f":"AB5*$AG$6+$A$326*AB5","v":0},{"$f":"AC5*$AG$6+$A$326*AC5","v":0},{"$f":"AD5*$AG$6+$A$326*AD5","v":0},{"$f":"AE5*$AG$6+$A$326*AE5","v":0},{"$f":"AF5*$AG$6","v":0},{"$f":" SUM($A$291:$A$336)","v":0},null,{"$f":"AI5*$AO$6+$T$326*AI5","v":0},{"$f":"AJ5*$AO$6+$T$326*AJ5","v":0},{"$f":"AK5*$AO$6+$T$326*AK5","v":0},{"$f":"AL5*$AO$6+$T$326*AL5","v":0},{"$f":"AM5*$AO$6+$T$326*AM5","v":0},{"$f":"AN5*$AO$6","v":0},{"$f":" SUM($T$291:$T$336)","v":0},null,"D","Produit = C x <Population>           Production sur la planète (avec 2 x  NIBSI pour OO)","Product = C x <Population>           Production on the planet (with x 2 FIDSI for US)"]
[false,null,{"$f":"6-'Planets - Planètes'!$A$38","v":3},{"$f":"IF('Planets - Planètes'!$A$36<>'Planets - Planètes'!$A$37,D$4-D$3,SUM(D$19:D$286))","v":0},{"$f":"IF('Planets - Planètes'!$A$36<>'Planets - Planètes'!$A$37,E$4-E$3,SUM(E$19:E$286))","v":0},{"$f":"IF('Planets - Planètes'!$A$36<>'Planets - Planètes'!$A$37,F$4-F$3,SUM(F$19:F$286))","v":0},{"$f":"IF('Planets - Planètes'!$A$36<>'Planets - Planètes'!$A$37,G$4-G$3,SUM(G$19:G$286))","v":0},{"$f":"IF('Planets - Planètes'!$A$36<>'Planets - Planètes'!$A$37,H$4-H$3,SUM(H$19:H$286))","v":0},{"$f":"IF('Planets - Planètes'!$A$36<>'Planets - Planètes'!$A$37,I$4-I$3,SUM(I$19:I$286))","v":0},{"$f":"IF('Planets - Planètes'!$A$36<>'Planets - Planètes'!$A$37,J$4-J$3,SUM(J$19:J$286))","v":0},null,{"$f":"IF(L$6>0,1,0)","v":0},{"$f":"IF(M$6>0,1,0)","v":0},{"$f":"IF(N$6>0,1,0)","v":0},{"$f":"IF(O$6>0,1,0)","v":0},{"$f":"IF($K$291,IF(AND($T$291>0,SUM($T$292:$T$336)>0),2,1),1)","v":1},{"$f":"R15>R16","v":false},{"$f":"IF(R$6>0,1,0)","v":0},null,{"$f":"IF(A7,1,0)","v":0},{"$f":"Language!A181","v":"Ecstatic / Devoted"},null,null,null,"E","Total D (-50% si épuis.)",{"$f":"AA$6/$T$8","v":0},{"$f":"AB$6/$T$8","v":0},{"$f":"AC$6/$T$8","v":0},{"$f":"AD$6/$T$8","v":0},{"$f":"AE$6/$T$8","v":0},{"$f":"AF$6","v":0},null,null,{"$f":"AI$6/$T$8","v":0},{"$f":"AJ$6/$T$8","v":0},{"$f":"AK$6/$T$8","v":0},{"$f":"AL$6/$T$8","v":0},{"$f":"AM$6/$T$8","v":0},{"$f":"AN$6","v":0},null,null,"E","Total = D /2                                              Si planète épuisée (Sauf Approbation)","Sum = D /2                                                If planet depleted (except Approval)"]
[false,null,null,null,null,null,{"$f":"IF($Q$6,Language!A166,\"\")","v":""},null,null,null,{"$f":"IF(SUMIF(U19:U286,Language!A175,B19:B286)>0,Language!A165,\"\")","v":""},null,null,null,{"$f":"IF($Q$7,Language!A166,\"\")","v":""},null,null,null,null,{"$f":"IF(A8,2,1)","v":1},{"$f":"Language!A182","v":"Planet depleted -50% FIDSI"},null,null,null,"F","Bonus Autotochnes",{"$f":"SUMIF($Z$19:$Z$286,\"=DUO\",D$19:D$286)+SUMIF($Z$19:$Z$286,\"=\"&TRUE(),D$19:D$286)","v":0},0,0,0,0,0,null,null,{"$f":"SUMIF($Z$19:$Z$286,\"=DUO\",L$19:L$286)+SUMIF($Z$19:$Z$286,\"=\"&TRUE(),L$19:L$286)","v":0},0,0,0,0,0,null,null,"F","Total des bonus des améliorations systèmes par Autotochnes par population","System improvement bonus sum per Original Empire population"]
[null,null,{"$f":"Language!A160 & IF($T$8=2,Language!A159,\"\")","v":"Total Planet + Bonus (without Original Empire and Population bonus)"},{"$f":"AA6","v":0},0,0,0,0,0,{"$f":"AG5","v":8},null,{"$f":"AI6","v":0},0,0,0,0,0,{"$f":"AO5","v":8},null,1,{"$f":"Language!A183 & $T$9","v":"Modernization level 1"},null,null,null,"G","Produit F x <Autot.>",{"$f":"AA8*$A$290","v":0},0,0,0,0,0,{"$f":"$A$290","v":0},null,{"$f":"AI8*$T$290","v":0},0,0,0,0,0,{"$f":"$T$290","v":0},null,"G","Produit = F x <Autotochnes>        Production spécifique des Autotochnes","Product = F x <Original>                   Original Empire population production"]
[null,null,{"$f":"Language!A161 & SUM($A$291:$A$336) & \"  →  \" & SUM($T$291:$T$336) & \")\"","v":"Total Population bonus (0  →  0)"},{"$f":"AA12+AA9+$A$326*AA5","v":0},{"$f":"AB12+AB9+$A$326*AB5","v":0},{"$f":"AC12+AC9+$A$326*AC5+(J15*(F127+F128))","v":0},{"$f":"AD12+AD9+$A$326*AD5","v":0},{"$f":"AE12+AE9+$A$326*AE5","v":0},{"$f":"AF12+AF9","v":0},null,null,{"$f":"AI12+AI9+$T$326*AI5","v":0},{"$f":"AJ12+AJ9+$T$326*AJ5","v":0},{"$f":"AK12+AK9+$T$326*AK5+(R15*(F127+F128))","v":0},{"$f":"AL12+AL9+$T$326*AL5","v":0},{"$f":"AM12+AM9+$T$326*AM5","v":0},{"$f":"AN12+AN9","v":0},null,null,null,null,null,null,null,"H","Produit C x <Esclav.>",{"$f":"AA$5*$AG$10","v":0},{"$f":"AB$5*$AG$10","v":0},{"$f":"AC$5*$AG$10","v":0},{"$f":"AD$5*$AG$10","v":0},null,null,{"$f":"($J$15-$A$291)*($P$6-1)","v":0},null,{"$f":"AI$5*$AO$10","v":0},{"$f":"AJ$5*$AO$10","v":0},{"$f":"AK$5*$AO$10","v":0},{"$f":"AL$5*$AO$10","v":0},null,null,{"$f":"($R$15-$T$291)*($P$7-1)","v":0},null,"H","Produit = C x <Esclaves>                 Production des esclaves = +100% NIBS","Product = C x <Slaves>                      Slave production = +100% FIDS"]
{"$rows_left_out":369}
{"sheet":"Difficulties - Difficultés","index":3,"n_rows":30,"n_cols":17,"rows_kept":30,"cut":false,"hidden":false,"merged":[[18,15,18,16],[6,14,6,18],[7,14,7,18],[0,14,0,18],[1,14,1,18],[2,14,2,18],[3,14,3,18],[4,14,4,18],[5,14,5,18]]}
["#",{"$f":"Language!A596","v":"Difficulty"},{"$f":"Language!A597","v":"Raw FIDSI on Planet"},{"$f":"Language!A598","v":"Raw Prestige on Planet"},{"$f":"Language!A599","v":"Approval"},{"$f":"Language!A600","v":"Over colonization threshold"},{"$f":"Language!A601","v":"Over colonization penalty"},{"$f":"Language!A602","v":"Over population penalty"},{"$f":"Language!A603","v":"System Upkeep"},{"$f":"Language!A604","v":"Garrison Upkeep"},{"$f":"Language!A605","v":"Hero Upkeep"},{"$f":"Language!A606","v":"Net Minor Stress"},{"$f":"Language!$A626","v":"Hacking Speed Percent Multiplier"},{"$f":"Language!$A627","v":"Maximum Empire Processing Power Stock"},{"$f":"Language!A607","v":"Description"}]
[0,{"$f":"Language!A610","v":"Sandbox"},2,null,20,2,null,-0.2,-0.2,-0.2,-0.2,-0.5,0.1,40,{"$f":"Language!A632","v":"An AI that allows you to play freely."}]
[1,{"$f":"Language!A611","v":"Easy"},1,null,10,1,null,-0.1,-0.1,-0.1,-0.1,-0.25,0.05,20,{"$f":"Language!A633","v":"It's like you have guns, and they have sticks."}]
[2,{"$f":"Language!A612","v":"Normal"},null,null,null,null,null,null,null,null,null,null,null,null,{"$f":"Language!A634","v":"It’s like you have guns, and they have guns."}]
[3,{"$f":"Language!A613","v":"Hard"},null,null,null,null,null,null,null,null,null,0.1,null,null,{"$f":"Language!A635","v":"It’s like you have guns, and they have better guns."}]
[4,{"$f":"Language!A614","v":"Serious"},null,null,null,null,null,null,null,null,null,0.2,null,null,{"$f":"Language!A636","v":"It’s like you have guns, and they have tanks."}]
[5,{"$f":"Language!A615","v":"Impossible"},null,null,null,null,null,null,null,null,null,0.3,null,null,{"$f":"Language!A637","v":"It’s like you have guns, and they have nuclear weapons systems that can track your biometrics."}]
[6,{"$f":"Language!A616","v":"Endless"},null,null,null,null,null,null,null,null,null,0.4,null,null,{"$f":"Language!A638","v":"You shall not pass!"}]
[]
[]
{"$rows_left_out":21}
{"sheet":"Language","index":4,"n_rows":672,"n_cols":7,"rows_kept":672,"cut":false,"hidden":false,"merged":[]}
[{"$f":"INDEX(Language!G4:G10,G3,1)","v":"English"},null,"Français","English","XML",null,"Selection"]
[{"$f":"IF(ISBLANK(C2),\"\",IF($G$3=1,C2,D2))","v":"Planets and Terraforming"},null,"Planètes et Terraformation","Planets and Terraforming"]
["",null,null,null,null,null,2]
["Planet",null,"Planète","Planet","Planet",null,"Français"]
["Terran",null,"Terrienne","Terran","Terran",null,"English"]
["Forest",null,"Forêt","Forest","Forest"]
["Ocean",null,"Océanique","Ocean","Ocean"]
["Atoll",null,"Atoll","Atoll","Atoll"]
["Boreal",null,"Boréal","Boreal","Boreal",null,{"$f":"\"Test\" & CHAR(10) & \"suite\"","v":"Test\nsuite"}]
["Jungle",null,"Jungle","Jungle","Jungle"]
{"$rows_left_out":663}
{"sheet":"MAP","index":5,"n_rows":0,"n_cols":0,"rows_kept":0,"cut":false,"hidden":false,"merged":[]}

{"sheet":"Sources","index":6,"n_rows":19,"n_cols":3,"rows_kept":19,"cut":false,"hidden":false,"merged":[]}
["Source","Notes","Fichier(s)"]
["! Jeux",null,"E:\\Steam\\steamapps\\common\\Endless Space 2\\Public"]
["Amélioration planète",null,"E:\\Steam\\steamapps\\common\\Endless Space 2\\Public\\Simulation\\SimulationDescriptors[StarSystemImprovement].xml"]
["Améliorations empire",null,"E:\\Steam\\steamapps\\common\\Endless Space 2\\Public\\Simulation\\SimulationDescriptors[EmpireImprovements].xml"]
["Anomalies",null,"E:\\Steam\\steamapps\\common\\Endless Space 2\\Public\\Simulation\\SimulationDescriptors[Planet].xml"]
["ClassColonizedPlanet",null,"E:\\Steam\\steamapps\\common\\Endless Space 2\\Public\\Simulation\\SimulationDescriptors[ColonizedPlanet].xml"]
["Compétences Héros",null,"E:\\Steam\\steamapps\\common\\Endless Space 2\\Public\\Simulation\\HeroSkillDefinitions.xml\nE:\\Steam\\steamapps\\common\\Endless Space 2\\Public\\Simulation\\SimulationDescriptors[HeroSkill].xml"]
["Difficultés",null,"E:\\Steam\\steamapps\\common\\Endless Space 2\\Public\\Simulation\\SimulationDescriptors[GameDifficulty].xml"]
["Inutilisé ?","Population / planète / rang ?","E:\\Steam\\steamapps\\common\\Endless Space 2\\Public\\GalaxyGenerator\\PlanetPopulationCapacityGroupDefinitions.xml"]
["Lois",null,"E:\\Steam\\steamapps\\common\\Endless Space 2\\Public\\Simulation\\LawDefinitions.xml\nE:\\Steam\\steamapps\\common\\Endless Space 2\\Public\\Simulation\\PoliticsDefinitions.xml\nE:\\Steam\\steamapps\\common\\Endless Space 2\\Public\\Simulation\\SimulationDescriptors[LawEffect].xml"]
{"$rows_left_out":10}
{"sheet":"Infos diverses & Notes","index":7,"n_rows":87,"n_cols":4,"rows_kept":87,"cut":false,"hidden":false,"merged":[]}
[null,"Gisements luxes",null,"Population majeure ou Autotochne"]
[null,null,null,"La population principale de l'empire (ex: Les Exilés si on joue avec les Exilés)"]
[1,"Luxe - Amianthoïdes (x2 dégats infligés aux assaillants au sol)"]
[2,"Arbres brumilicieux (+60D sur système)"]
[3,"Artefacts virtuels (+100% cap MO + 5% MO par niveau du système)",null,"A faire"]
[4,"Bourgeons de Brume (+100% valeur commerciale)"]
[5,"Cités perdus (artefacts N-P) (+2App pp)"]
[6,"Cyrstal Ionique (+4S pp)"]
[7,"Eau-de-Brume (+15%D par niveau du syst.)"]
[8,"Encens d'Eden (+30In sur système)"]
{"$rows_left_out":77}